{"text_format":"1","workbook":"xlsx","n_sheets":16,"sheets":["Constants","COVER PAGE","INTRODUCTION","IP PRICING TOOL","FULL COST BUDGET","CONTRACT PRICE ZAR","CONTRACT PRICE FOREX","DEVIATION REPORT","Detailed Quote for Client","Standard Quote for Client","Summarised Quote for Client ","BRL","SUNFIN - Full Cost Budget","SUNFIN - Contract budget","SUNFIN -  Forex Contract budget","TEMPLAAT"],"not_rendered":{"charts":1,"images":0,"macros":1,"external_links":0,"defined_names":60,"comments":2,"pivot_tables":0},"unopened":[],"bounds":{"document_bytes":16777216,"sheet_cells":100000,"rows_first":2000,"rows_last":500,"rows_between":2000,"halvings":0,"cell_chars":16384,"cell_head_chars":4096},"cells_cut":0,"cells_raw":0,"read":"whole","date_system":"1900"}

{"sheet":"Constants","index":0,"n_rows":39,"n_cols":14,"rows_kept":39,"cut":false,"hidden":true,"merged":[]}
[null,null,"Year 1",null,null,null,null,null,null,null,2025]
["Faculty dropdown menu",null,"VAT calculations "]
["AgriSciences",null,"SA VAT",null,null,null,null,null,null,null,0.155]
["Arts and Social Sciences",null,"Foreign",null,null,null,null,null,null,null,{"$f":"'COVER PAGE'!B21","v":"NO"},"From cover page"]
["Economic and Management Sciences",null,"VATForeign",null,null,null,null,null,null,null,{"$f":"IF(K4=\"YES\",0%,K3)","v":0.155},"If foreign client, then VAT = 0%"]
["Education"]
["Engineering",null,"Yearly increase in tariff for staff cost",null,null,null,null,null,null,null,null,null,0.06,"StaffIncrPerc"]
["Law"]
["Medicine and Health Sciences",null,"Equipment exempted from ICRR",null,null,null,null,null,null,null,1000000]
["Military Science"]
{"$rows_left_out":30}
{"sheet":"COVER PAGE","index":1,"n_rows":25,"n_cols":3,"rows_kept":25,"cut":false,"hidden":false,"merged":[]}
["Project Name","Enter NAME"]
["Principal Investigator","Enter PI name","The Principal Investigator on the project."]
["Contract number (S-number)","Enter S-number","Supplied by Contracts Office"]
["Funder/Client name","Enter funder","Enter institution / Company name"]
["Legal Advisor","Select Legal Advisor","Select from drop-down list"]
["Full Cost Accountant","Select Accountant","Select from drop-down list"]
[]
["Indirect Cost Recovery Rate (ICRR)",0.2,"As per SU Policy."]
["Does the funder restrict the indirect cost percentage allowed?","NO"]
["Indirect Cost Recovery Rate funder restrictions",0.1,"If the funder restricts the indirect cost recovery rate, please submit proof and indicate allowable percentage. Subject to formal approval by the ICRR committee. "]
{"$rows_left_out":16}
{"sheet":"INTRODUCTION","index":2,"n_rows":71,"n_cols":2,"rows_kept":71,"cut":false,"hidden":false,"merged":[[32,0,34,0],[25,0,26,0],[48,0,49,0],[50,0,51,0],[52,0,53,0]]}
["INTRODUCTION"]
[]
[null,"By using this template, the contract price will be profitable and within legal and regulatory guidelines. "]
[null,"The Contract Pricing phase of this process allows for extensive PRICE editing, so that the researcher will not lose his/her autonomy: this will simply provide the researcher with a solid decisionmaking base."]
[null,"This template is a step by step guide to assist you to optimise the planning and costing of Research Contracts"]
[]
["The basic steps:"]
[1,"INTRODUCTION ( current page) - Contains detailed instructions and hyperlinks to assist you with the budgeting process. This worksheet can be consulted throughout."]
[2,"FULL COST BUDGET- Reflects actual cost of the contract/project."]
[3,"IP PRICING TOOL - Evaluates the factors that impact the pricing of a contract. These include Intellectual Property and Academic Footprint of a contract."]
{"$rows_left_out":62}
{"sheet":"IP PRICING TOOL","index":3,"n_rows":73,"n_cols":9,"rows_kept":73,"cut":false,"hidden":false,"merged":[[51,0,51,4],[52,0,52,4],[53,0,53,4],[47,0,47,4],[48,0,48,4],[50,0,50,4],[69,1,69,4],[71,1,71,4],[54,0,54,4],[56,0,56,4],[57,0,57,4],[55,0,55,4],[65,0,65,4],[67,1,67,4],[68,1,68,4],[2,2,2,4],[4,2,4,4],[5,2,5,4],[6,2,6,4],[58,0,58,4],[36,0,36,4],[41,0,41,4],[42,0,42,4],[43,0,43,4],[44,0,44,4],[45,0,45,4],[49,0,49,4],[20,0,20,4],[46,0,46,4],[28,1,28,4],[29,1,29,4],[30,1,30,4],[26,1,26,4],[27,1,27,4],[37,0,37,8],[38,0,38,8],[3,2,3,4],[71,5,71,8],[72,1,72,4],[72,5,72,8],[17,1,17,8],[7,2,7,4],[8,2,8,4],[13,0,13,4],[10,1,10,8],[14,1,14,8],[15,1,15,8],[16,1,16,8],[22,1,22,4],[23,1,23,4],[24,1,24,4],[25,1,25,4]]}
[]
[]
[null,"Contract number",{"$f":"ContractNumber","v":"Enter S-number"}]
[null,"Project name",{"$f":"'COVER PAGE'!B1","v":"Enter NAME"}]
[null,"Client",{"$f":"Client","v":"Enter funder"}]
[null,"Date"]
[null,"SU Project leader",{"$f":"'COVER PAGE'!B2","v":"Enter PI name"}]
[null,"Department",{"$f":"IF(ISBLANK(Department),\"\",Department)","v":""}]
[null,"Faculty",{"$f":"IF(ISBLANK(Faculty),\"\",Faculty)","v":""}]
[]
{"$rows_left_out":64}
{"sheet":"FULL COST BUDGET","index":4,"n_rows":106,"n_cols":20,"rows_kept":106,"cut":false,"hidden":false,"merged":[[1,3,1,4],[2,3,2,4],[99,2,99,3],[25,2,25,3],[18,2,18,3],[58,2,58,3],[64,2,64,3],[79,2,79,3],[46,2,46,3],[78,2,78,3],[4,0,4,3],[77,2,77,3]]}
[null,null,"FULL COST BUDGET: RESEARCH BUDGET"]
[null,null,"Principal Investigator",{"$f":"PrincipalInvestigator","v":"Enter PI name"}]
[null,null,"PROJECT NAME:",{"$f":"ProjectName","v":"Enter NAME"}]
[]
["DIRECT COST",null,null,null,null,null,"Year 1",null,null,"Year 2",null,null,"Year 3",null,null,"Year 4",null,null,"Year 5","TOTAL"]
["1. Personnel ",null,null,null,null,null,{"$f":"Year1","v":2025},null,null,{"$f":"G6+1","v":2026},null,null,{"$f":"J6+1","v":2027},null,null,{"$f":"M6+1","v":2028},null,null,{"$f":"P6+1","v":2029},"FULL COST"]
[null,1.1000000000000001,"US Professional personnel and US research support personnel","Minimum tariff per hour ","Hours","Rate/hour","Amount","Hours","Rate/hour","Amount","Hours","Rate/hour","Amount","Hours","Rate/hour","Amount","Hours","Rate/hour","Amount","Total Amount"]
[null,null,"Professor P5",{"$f":"(IF(ISBLANK(C8),0,VLOOKUP(C8,BRL!$B$5:$M$24,12,FALSE)))","v":858.35692307692307},null,{"$f":"IF(ISBLANK(E8),\"\",D8)","v":""},{"$f":"IFERROR(F8*E8,0)","v":0},null,{"$f":"IF(ISBLANK(H8),0,IFERROR(F8*(1+StaffIncrPerc),0))","v":0},{"$f":"IFERROR(I8*H8,0)","v":0},null,{"$f":"IF(ISBLANK(K8),0,IFERROR(I8*(1+StaffIncrPerc),0))","v":0},{"$f":"IFERROR(L8*K8,0)","v":0},null,{"$f":"IF(ISBLANK(N8),0,IFERROR(L8*(1+StaffIncrPerc),0))","v":0},{"$f":"IFERROR(O8*N8,0)","v":0},null,{"$f":"IF(ISBLANK(Q8),0,IFERROR(O8*(1+StaffIncrPerc),0))","v":0},{"$f":"IFERROR(R8*Q8,0)","v":0},{"$f":"SUM(G8,J8,M8,P8,S8)","v":0}]
[null,null,"Senior Lecturer P7",{"$f":"(IF(ISBLANK(C9),0,VLOOKUP(C9,BRL!$B$5:$M$24,12,FALSE)))","v":572.33282051282049},null,"",0,null,0,0,null,0,0,null,0,0,null,0,0,0]
[null,null,"Lecturer P8",{"$f":"(IF(ISBLANK(C10),0,VLOOKUP(C10,BRL!$B$5:$M$24,12,FALSE)))","v":452.31538461538463},null,"",0,null,0,0,null,0,0,null,0,0,null,0,0,0]
{"$rows_left_out":97}
{"sheet":"CONTRACT PRICE ZAR","index":5,"n_rows":113,"n_cols":20,"rows_kept":113,"cut":false,"hidden":false,"merged":[[52,2,52,3],[61,2,61,3],[67,2,67,3],[102,2,102,3],[92,2,92,3],[100,2,100,3],[101,2,101,3],[80,2,80,3],[81,2,81,3],[0,2,0,19],[7,0,7,3],[49,2,49,3],[17,2,17,3],[18,2,18,3],[19,2,19,3],[20,2,20,3],[21,2,21,3],[22,2,22,3],[28,2,28,3],[25,2,25,3],[26,2,26,3],[27,2,27,3]]}
[null,null,"CONTRACT BUDGET: RESEARCH BUDGET"]
[null,null,"PROJECT NAME:",{"$f":"ProjectName","v":"Enter NAME"}]
[null,null,"FACULTY:",{"$f":"IF(ISBLANK(Faculty),\"\",Faculty)","v":""}]
[]
[null,null,"All figures entered into the FULL COST BUDGET will automatically be reflected in this CONTRACT PRICE BUDGET. "]
[null,null,"These figures thus copied are reflected as a guideline only and may be edited, deleted or added to, to fulfill contract requirements, and determine the CONTRACT PRICE."]
[null,null,"For budgets in foreign currency please complete this budget first, foreign currency budget wil be addressed at the next stage."]
["DIRECT COST",null,null,null,null,null,"Year 1",null,null,"Year 2",null,null,"Year 3",null,null,"Year 4",null,null,"Year 5","TOTAL"]
["1. Personnel ",null,null,null,null,null,{"$f":"Year1","v":2025},null,null,{"$f":"G9+1","v":2026},null,null,{"$f":"J9+1","v":2027},null,null,2028,null,null,2029,"FULL COST"]
[null,1.1000000000000001,{"$f":"'FULL COST BUDGET'!C7","v":"US Professional personnel and US research support personnel"},"Minimum tariff per hour that you may ask for this US employee (Refer to BRL sheet):","Hours","Rate/hour","Amount","Hours","Rate/hour","Amount","Hours","Rate/hour","Amount","Hours","Rate/hour","Amount","Hours","Rate/hour","Amount","Total Amount"]
{"$rows_left_out":104}
{"sheet":"CONTRACT PRICE FOREX","index":6,"n_rows":103,"n_cols":13,"rows_kept":103,"cut":false,"hidden":false,"merged":[[5,12,6,12],[6,2,6,3],[6,4,6,5],[6,6,6,7],[6,8,6,9],[6,10,6,11],[5,2,5,3],[5,4,5,5],[5,6,5,7],[5,8,5,9],[5,10,5,11]]}
[null,"CONTRACT BUDGET: RESEARCH BUDGET"]
[null,{"$f":" \"PROJECT NAME: \"&ProjectName","v":"PROJECT NAME: Enter NAME"}]
[null,{"$f":"\"FACULTY: \"&IF(ISBLANK(Faculty),\"\",Faculty)","v":"FACULTY: "},null,null,null,null,"FOREIGN CURRENCY selected",null,{"$f":"IF(IsForeignClient=\"YES\",IF(ISBLANK('COVER PAGE'!B23),ForeignCurr,'COVER PAGE'!B23))","v":false}]
[null,null,null,null,null,null,{"$f":"'COVER PAGE'!B24","v":0}]
["DIRECT COST"]
[null,null,"Year 1",null,"Year 2",null,"Year 3",null,"Year 4",null,"Year 5",null,"TOTAL          FULL COST"]
["1. Personnel ",null,2023,null,{"$f":"C7+1","v":2024},null,{"$f":"E7+1","v":2025},null,{"$f":"G7+1","v":2026},null,{"$f":"I7+1","v":2027}]
[1.1000000000000001,"US Professional personnel and US research support personnel (e.g. Researchers, assistants, technicians and consultants)","Amount ZAR","Amount Forex","Amount ZAR","Amount Forex","Amount ZAR","Amount Forex","Amount ZAR","Amount Forex","Amount ZAR","Amount Forex","Total Amount Forex"]
[null,{"$f":"IF(ISBLANK('FULL COST BUDGET'!C8),\"\",'FULL COST BUDGET'!C8)","v":"Professor P5"},{"$f":"VALUE('CONTRACT PRICE ZAR'!G11)","v":0},{"$f":"C9/$G$4","v":{"$error":"#DIV/0!"}},{"$f":"VALUE('CONTRACT PRICE ZAR'!J11)","v":0},{"$f":"E9/$G$4","v":{"$error":"#DIV/0!"}},{"$f":"VALUE('CONTRACT PRICE ZAR'!M11)","v":0},{"$f":"G9/$G$4","v":{"$error":"#DIV/0!"}},{"$f":"VALUE('CONTRACT PRICE ZAR'!P11)","v":0},{"$f":"I9/$G$4","v":{"$error":"#DIV/0!"}},{"$f":"VALUE('CONTRACT PRICE ZAR'!S11)","v":0},{"$f":"K9/$G$4","v":{"$error":"#DIV/0!"}},{"$f":"D9+F9+H9+J9+L9","v":{"$error":"#DIV/0!"}}]
[null,{"$f":"IF(ISBLANK('FULL COST BUDGET'!C9),\"\",'FULL COST BUDGET'!C9)","v":"Senior Lecturer P7"},{"$f":"VALUE('CONTRACT PRICE ZAR'!G12)","v":0},{"$error":"#DIV/0!"},{"$f":"VALUE('CONTRACT PRICE ZAR'!J12)","v":0},{"$error":"#DIV/0!"},{"$f":"VALUE('CONTRACT PRICE ZAR'!M12)","v":0},{"$error":"#DIV/0!"},{"$f":"VALUE('CONTRACT PRICE ZAR'!P12)","v":0},{"$error":"#DIV/0!"},{"$f":"VALUE('CONTRACT PRICE ZAR'!S12)","v":0},{"$error":"#DIV/0!"},{"$error":"#DIV/0!"}]
{"$rows_left_out":94}
{"sheet":"DEVIATION REPORT","index":7,"n_rows":104,"n_cols":20,"rows_kept":104,"cut":false,"hidden":false,"merged":[[8,2,8,7],[10,7,11,7],[10,19,11,19],[8,14,8,19],[10,13,11,13],[8,8,8,13]]}
[null,null,"DEVIATION REPORT: RESEARCH BUDGET"]
[null,null,"PROJECT NAME:",{"$f":"ProjectName","v":"Enter NAME"}]
[null,null,"FACULTY:",{"$f":"IF(ISBLANK(Faculty),\"\",Faculty)","v":""}]
[]
[null,null,"The total deviation from column P-U indicates your profit/loss at this stage of the budgeting process."]
[null,null,"This discrepancy may be used to adjust the CONTRACT BUDGET ZAR to ensure efficient profit."]
[null,null,"Revise this DEVIATION REPORT once adjustments have been made to CONTRACT BUDGET ZAR."]
[null,null,"Upon finalisation of this process kindly proceed to QUOTATION FOR CLIENT for the amounts to be reflected in your contract or quote."]
[null,null,"FULL COST BUDGET",null,null,null,null,null,"CONTRACT BUDGET",null,null,null,null,null,"DEVIATION"]
[]
{"$rows_left_out":95}
{"sheet":"Detailed Quote for Client","index":8,"n_rows":76,"n_cols":9,"rows_kept":76,"cut":false,"hidden":false,"merged":[[7,0,7,2]]}
["CONTRACT BUDGET: RESEARCH BUDGET"]
[]
["PROJECT NAME:",null,{"$f":"ProjectName","v":"Enter NAME"},null,"CONTRACT NUMBER (S-number)",null,{"$f":"ContractNumber","v":"Enter S-number"}]
["FACULTY:",null,{"$f":"IF(ISBLANK(Faculty),\"\",Faculty)","v":""},null,"PRINCIPAL INVESTIGATOR",null,{"$f":"PrincipalInvestigator","v":"Enter PI name"}]
["DEPARTMENT",null,{"$f":"IF(ISBLANK(Department),\"\",Department)","v":""},null,"FUNDER / CLIENT NAME",null,{"$f":"Client","v":"Enter funder"}]
[]
[null,null,null,"Year 1","Year 2","Year 3","Year 4","Year 5","CONTRACT TOTAL"]
["DIRECT COST",null,null,{"$f":"Year1","v":2025},{"$f":"D8+1","v":2026},{"$f":"E8+1","v":2027},{"$f":"F8+1","v":2028},{"$f":"G8+1","v":2029}]
["1. Personnel ",1.1000000000000001,{"$f":"'FULL COST BUDGET'!C7","v":"US Professional personnel and US research support personnel"},"Amount","Amount","Amount","Amount","Amount","Total Amount"]
[null,null,{"$f":"IF(ISBLANK('FULL COST BUDGET'!C8),\"\",'FULL COST BUDGET'!C8)","v":"Professor P5"},{"$f":"'CONTRACT PRICE ZAR'!G11","v":0},{"$f":"'CONTRACT PRICE ZAR'!J11","v":0},{"$f":"'CONTRACT PRICE ZAR'!M11","v":0},{"$f":"'CONTRACT PRICE ZAR'!P11","v":0},{"$f":"'CONTRACT PRICE ZAR'!S11","v":0},{"$f":"SUM(D10:H10)","v":0}]
{"$rows_left_out":67}
{"sheet":"Standard Quote for Client","index":9,"n_rows":49,"n_cols":8,"rows_kept":49,"cut":false,"hidden":false,"merged":[[6,7,7,7]]}
["CONTRACT BUDGET: RESEARCH BUDGET"]
[]
["PROJECT NAME:",{"$f":"ProjectName","v":"Enter NAME"},null,"CONTRACT NUMBER (S-number)",null,{"$f":"ContractNumber","v":"Enter S-number"}]
["FACULTY:",{"$f":"IF(ISBLANK(Faculty),\"\",Faculty)","v":""},null,"PRINCIPAL INVESTIGATOR",null,{"$f":"PrincipalInvestigator","v":"Enter PI name"}]
["DEPARTMENT",{"$f":"IF(ISBLANK(Department),\"\",Department)","v":""},null,"FUNDER / CLIENT NAME",null,{"$f":"Client","v":"Enter funder"}]
[]
[null,null,"Year 1","Year 2","Year 3","Year 4","Year 5","CONTRACT TOTAL"]
["DIRECT COST",null,{"$f":"Year1","v":2025},{"$f":"C8+1","v":2026},{"$f":"D8+1","v":2027},{"$f":"E8+1","v":2028},{"$f":"F8+1","v":2029}]
["1. Personnel ",null,"Amount","Amount","Amount","Amount","Amount","Total Amount"]
[null,"Total US Professional and support personnel",{"$f":"'CONTRACT PRICE ZAR'!G17","v":0},{"$f":"'CONTRACT PRICE ZAR'!J17","v":0},{"$f":"'CONTRACT PRICE ZAR'!M17","v":0},{"$f":"'CONTRACT PRICE ZAR'!P17","v":0},{"$f":"'CONTRACT PRICE ZAR'!S17","v":0},{"$f":"SUM(C10,D10,E10,F10,G10)","v":0}]
{"$rows_left_out":40}
{"sheet":"Summarised Quote for Client ","index":10,"n_rows":33,"n_cols":8,"rows_kept":33,"cut":false,"hidden":false,"merged":[[7,7,8,7]]}
["CONTRACT BUDGET: RESEARCH BUDGET"]
[]
["PROJECT NAME:",{"$f":"ProjectName","v":"Enter NAME"},null,"CONTRACT NUMBER (S-number)",null,{"$f":"ContractNumber","v":"Enter S-number"}]
["FACULTY:",{"$f":"IF(ISBLANK(Faculty),\"\",Faculty)","v":""},null,"PRINCIPAL INVESTIGATOR",null,{"$f":"PrincipalInvestigator","v":"Enter PI name"}]
["DEPARTMENT",{"$f":"IF(ISBLANK(Department),\"\",Department)","v":""},null,"FUNDER / CLIENT NAME",null,{"$f":"Client","v":"Enter funder"}]
[]
[]
[null,null,"Year 1","Year 2","Year 3","Year 4","Year 5","CONTRACT TOTAL"]
["DIRECT COST",null,{"$f":"Year1","v":2025},{"$f":"C9+1","v":2026},{"$f":"D9+1","v":2027},{"$f":"E9+1","v":2028},{"$f":"F9+1","v":2029}]
["Personnel ",null,"Amount","Amount","Amount","Amount","Amount","Total Amount"]
{"$rows_left_out":24}
{"sheet":"BRL","index":11,"n_rows":27,"n_cols":15,"rows_kept":27,"cut":false,"hidden":false,"merged":[[2,1,2,11],[4,0,9,0],[11,0,23,0]]}
["                            Basic remuneration levels  (BRL) for 2025 as approved by the Human Resources"]
[]
[null,"The 2025 BRL tariff per hour as communicated by HR",null,null,null,null,null,null,null,null,null,null,{"$f":"Year1","v":2025},{"$f":"M3+1","v":2026},{"$f":"N3+1","v":2027}]
["Type","POST LEVEL","US BRL","MAX 25% above BRL","1/8th","2/8th","3/8th","4/8th","5/8th","6/8th","7/8th","Hours for year","R/hour","Added 6%","Added 6%"]
["Academics","Junior Lecturer P9",590557,{"$f":"C5*1.25","v":738196.25},null,null,null,null,null,null,null,1950,{"$f":"C5/L5","v":302.84974358974358},{"$f":"M5*1.06","v":321.02072820512819},340.28197189743588]
[null,"Lecturer P8",882015,{"$f":"C6*1.25","v":1102518.75},null,null,null,null,null,null,null,1950,452.31538461538463,479.45430769230774,508.22156615384625]
[null,"Senior Lecturer P7",1116049,1395061.25,null,null,null,null,null,null,null,1950,572.33282051282049,606.67278974358976,643.07315712820514]
[null,"Associate Professor P6",1343280,1679100,null,null,null,null,null,null,null,1950,688.86153846153843,730.19323076923081,774.00482461538468]
[null,"Professor P5",1673796,2092245,null,null,null,null,null,null,null,1950,858.35692307692307,909.85833846153855,964.44983876923095]
[null,"Distinguished Professor  P4",1706384,2132980,null,null,null,null,null,null,null,1950,875.0687179487179,927.57284102564097,983.22721148717949]
{"$rows_left_out":18}
{"sheet":"SUNFIN - Full Cost Budget","index":12,"n_rows":35,"n_cols":14,"rows_kept":35,"cut":false,"hidden":false,"merged":[[3,1,3,5],[4,1,4,5]]}
["FULL COST ZAR BUDGET: RESEARCH BUDGET"]
["Principal Investigator",{"$f":"'COVER PAGE'!B2","v":"Enter PI name"}]
["Contract Number",{"$f":"'COVER PAGE'!B3","v":"Enter S-number"}]
["PROJECT NAME:",{"$f":"'COVER PAGE'!B1","v":"Enter NAME"}]
["FACULTY:",{"$f":"'COVER PAGE'!B14","v":0}]
["Departmental levy",{"$f":"IF(IsDeptLevy=\"YES\",DeptLevy,0)","v":0}]
["Faculty levy",{"$f":"IF(IsFactLevy=\"YES\",FacultyLevy,0)","v":0}]
["ICRR",{"$f":"ICRR","v":0.2}]
["Total Overhead charges",{"$f":"SUM(B6:B8)","v":0.2}]
["Does the funder restrict/waive the indirect cost percentage?",{"$f":"IsIndirectRestricted","v":"NO"}]
{"$rows_left_out":26}
{"sheet":"SUNFIN - Contract budget","index":13,"n_rows":43,"n_cols":14,"rows_kept":43,"cut":false,"hidden":false,"merged":[[3,1,3,5],[4,1,4,5]]}
["CONTRACT PRICE ZAR BUDGET: RESEARCH BUDGET"]
["Principal Investigator",{"$f":"'COVER PAGE'!B2","v":"Enter PI name"}]
["Contract Number",{"$f":"'COVER PAGE'!B3","v":"Enter S-number"}]
["PROJECT NAME:",{"$f":"'COVER PAGE'!B1","v":"Enter NAME"}]
["FACULTY:",{"$f":"'COVER PAGE'!B14","v":0}]
["Departmental levy",{"$f":"IF(IsDeptLevy=\"YES\",DeptLevy,0)","v":0}]
["Faculty levy",{"$f":"IF(IsFactLevy=\"YES\",FacultyLevy,0)","v":0}]
["ICRR",{"$f":"IF(IsIndirectRestricted=\"Yes\",Hide1,ICRR)","v":0.2}]
["Total Overhead charges",{"$f":"SUM(B6:B8)","v":0.2}]
["Does the funder restrict the indirect cost percentage allowed?",{"$f":"IsIndirectRestricted","v":"NO"}]
{"$rows_left_out":34}
{"sheet":"SUNFIN -  Forex Contract budget","index":14,"n_rows":36,"n_cols":14,"rows_kept":36,"cut":false,"hidden":false,"merged":[[4,1,4,5],[5,1,5,5]]}
["CONTRACT PRICE ZAR BUDGET: RESEARCH BUDGET"]
[]
["Principal Investigator",{"$f":"'COVER PAGE'!B2","v":"Enter PI name"}]
["Contract Number",{"$f":"'COVER PAGE'!B3","v":"Enter S-number"}]
["PROJECT NAME:",{"$f":"'COVER PAGE'!B1","v":"Enter NAME"}]
["FACULTY:",{"$f":"'COVER PAGE'!B14","v":0}]
["Departmental levy",{"$f":"IF(IsDeptLevy=\"YES\",DeptLevy,0)","v":0}]
["Faculty levy",{"$f":"IF(IsFactLevy=\"YES\",FacultyLevy,0)","v":0}]
["ICRR",{"$f":"IF(IsIndirectRestricted=\"Yes\",Hide1,ICRR)","v":0.2}]
["Total Overhead charges",{"$f":"SUM(B7:B9)","v":0.2}]
{"$rows_left_out":27}
{"sheet":"TEMPLAAT","index":15,"n_rows":62,"n_cols":13,"rows_kept":62,"cut":false,"hidden":true,"merged":[[1,2,1,12],[2,2,2,12],[28,10,29,10],[28,11,29,11],[44,2,44,12],[43,4,43,12],[41,4,41,12],[42,4,42,12],[28,7,29,7],[28,8,29,8],[38,4,38,12],[31,4,31,11],[34,4,34,11]]}
[]
[null,null,"VOLKOSTE GOEDKEURING"]
[null,null,"FULL COST APPROVAL"]
[]
[null,null,"KLIëNT NAAM/CLIENT NAME",null,{"$f":"'COVER PAGE'!B4","v":"Enter funder"}]
[]
[]
[null,null,"PROJEK NAAM/PROJECT NAME ",null,{"$f":"'COVER PAGE'!B1","v":"Enter NAME"}]
[null,null,null,null,null,null,null,null,null,null,null,null,{"$f":"UPPER(E9)","v":""}]
[null,null,null,null,null,null,null,null,null,null,null,null,""]
{"$rows_left_out":52}